{"text_format":"1","workbook":"xlsx","n_sheets":24,"sheets":["Cover","Start","Header","1. Instructions","2. Hospital Information","3. Key Assumptions","4. Clinical Staffing Coverage","5. Staffing Costs","6. Capital Costs","7. Operating Costs","8. Expected Revenue","9. Pro Forma","10. Feasibility Results","Scenario Data","Data Tables","Scenario Model","Avg Cost Curve","Expense Summary","Assumptions","3 Model Graph","FED FAST Inputs","Definitions","References","Acknowledgements"],"not_rendered":{"charts":10,"images":13,"macros":1,"external_links":0,"defined_names":49,"comments":0,"pivot_tables":6},"unopened":[],"bounds":{"document_bytes":16777216,"sheet_cells":100000,"rows_first":2000,"rows_last":500,"rows_between":2000,"halvings":0,"cell_chars":16384,"cell_head_chars":4096},"cells_cut":0,"cells_raw":0,"read":"whole","date_system":"1900"}

{"sheet":"Cover","index":0,"n_rows":0,"n_cols":0,"rows_kept":0,"cut":false,"hidden":true,"merged":[]}

{"sheet":"Start","index":1,"n_rows":4,"n_cols":2,"rows_kept":4,"cut":false,"hidden":false,"merged":[]}
[]
[]
[null,"Welcome to the FED FAST"]
[null,"The Freestanding Emergency Department Financial Assessment Strategic Tool"]

{"sheet":"Header","index":2,"n_rows":0,"n_cols":0,"rows_kept":0,"cut":false,"hidden":true,"merged":[]}

{"sheet":"1. Instructions","index":3,"n_rows":80,"n_cols":18,"rows_kept":80,"cut":false,"hidden":false,"merged":[]}
[]
[]
[]
[]
[]
[]
[]
[]
[]
[]
[]
[]
[]
[]
[]
[]
[]
[]
[]
[]
{"$rows_left_out":61}
{"sheet":"2. Hospital Information","index":4,"n_rows":221,"n_cols":62,"rows_kept":221,"cut":false,"hidden":false,"merged":[]}
[]
[]
[]
[]
[]
[null,"Please enter information about your organization in the space provided."]
[]
[]
[]
[null,"Hospital Name","General Hospital"]
[]
[null,"Hospital State","North Carolina",{"$f":"HYPERLINK(\"#\"&ADDRESS(ROW(),COLUMN()-1),CHAR(128))","v":"€"}]
[]
[null,"Affiliation with Hospital System?","Yes",{"$f":"HYPERLINK(\"#\"&ADDRESS(ROW(),COLUMN()-1),CHAR(128))","v":"€"}]
[]
[]
[]
[]
[]
[]
{"$rows_left_out":202}
{"sheet":"3. Key Assumptions","index":5,"n_rows":95,"n_cols":5,"rows_kept":95,"cut":false,"hidden":false,"merged":[]}
[]
[]
[]
[]
[]
[null,"The calculations provided in this tool are based on the following assumptions. "]
[null,"*Note: The values below can be used as a starting point, but may be modified if you have organization-specific values. "]
[]
[]
[null,"General Assumption(s)"]
[]
[]
[null,"Inflation rate on costs:",null,0.03]
[]
[]
[]
[]
[]
[]
[]
{"$rows_left_out":76}
{"sheet":"4. Clinical Staffing Coverage","index":6,"n_rows":52,"n_cols":9,"rows_kept":52,"cut":false,"hidden":false,"merged":[]}
[]
[]
[]
[]
[]
[]
[]
[]
[]
[]
[]
[]
[]
[]
[]
[]
[null,null,null,null,"How many beds will each RN be responsible for?",8]
[null,null,null,null,"How many beds will each CNA be responsible for?",12]
[]
[null,null,null,null,"Number of ED Beds in Facility",{"$f":"NumberBeds","v":12}]
{"$rows_left_out":33}
{"sheet":"5. Staffing Costs","index":7,"n_rows":53,"n_cols":7,"rows_kept":53,"cut":false,"hidden":false,"merged":[]}
[]
[]
[]
[]
[]
[null,"This worksheet calculates the staffing costs for your FED. "]
[]
[null,"Please enter your annual FTEs and staffing costs in the spaces provided below. "]
[]
[null,"Administration","FTEs","Salary","Bonus","Benefits","Total Compensation"]
[null,"Emergency Services Director",1,109918,null,{"$f":"LeadershipCosts[[#This Row],[Salary]]*0.224","v":24621.632000000001},{"$f":"LeadershipCosts[[#This Row],[FTEs]]*SUM(LeadershipCosts[[#This Row],[Salary]:[Benefits]])","v":134539.63200000001}]
[null,"Charge Nurse - ED",1,82319,null,{"$f":"LeadershipCosts[[#This Row],[Salary]]*0.224","v":18439.456000000002},{"$f":"LeadershipCosts[[#This Row],[FTEs]]*SUM(LeadershipCosts[[#This Row],[Salary]:[Benefits]])","v":100758.45600000001}]
[null,"Other",null,null,null,{"$f":"LeadershipCosts[[#This Row],[Salary]]*0.224","v":0},{"$f":"LeadershipCosts[[#This Row],[FTEs]]*SUM(LeadershipCosts[[#This Row],[Salary]:[Benefits]])","v":0}]
[null,"Other",null,null,null,{"$f":"LeadershipCosts[[#This Row],[Salary]]*0.224","v":0},{"$f":"LeadershipCosts[[#This Row],[FTEs]]*SUM(LeadershipCosts[[#This Row],[Salary]:[Benefits]])","v":0}]
[null,"Other",null,null,null,{"$f":"LeadershipCosts[[#This Row],[Salary]]*0.224","v":0},{"$f":"LeadershipCosts[[#This Row],[FTEs]]*SUM(LeadershipCosts[[#This Row],[Salary]:[Benefits]])","v":0}]
[null,"Total",{"$f":"SUBTOTAL(109,LeadershipCosts[FTEs])","v":2},{"$f":"SUBTOTAL(109,LeadershipCosts[Salary])","v":192237},{"$f":"SUBTOTAL(109,LeadershipCosts[Bonus])","v":0},{"$f":"SUBTOTAL(109,LeadershipCosts[Benefits])","v":43061.088000000003},{"$f":"SUBTOTAL(109,LeadershipCosts[Total Compensation])","v":235298.08800000002}]
[null,"Clinical Support","FTEs","Salary","Bonus","Benefits","Total Compensation"]
[null,"Physician - ED / FP",{"$f":"'4. Clinical Staffing Coverage'!I46","v":7},280000,null,{"$f":"ProviderCosts[[#This Row],[Salary]]*0.224","v":62720},{"$f":"ProviderCosts[[#This Row],[FTEs]]*SUM(ProviderCosts[[#This Row],[Salary]:[Benefits]])","v":2399040}]
[null,"Physician Assistant",{"$f":"'4. Clinical Staffing Coverage'!I49","v":0},83425,null,{"$f":"ProviderCosts[[#This Row],[Salary]]*0.224","v":18687.2},{"$f":"ProviderCosts[[#This Row],[FTEs]]*SUM(ProviderCosts[[#This Row],[Salary]:[Benefits]])","v":0}]
[null,"Nurse Practitioner",{"$f":"'4. Clinical Staffing Coverage'!I52","v":2.4},89005,null,{"$f":"ProviderCosts[[#This Row],[Salary]]*0.224","v":19937.12},{"$f":"ProviderCosts[[#This Row],[FTEs]]*SUM(ProviderCosts[[#This Row],[Salary]:[Benefits]])","v":261461.08799999999}]
{"$rows_left_out":34}
{"sheet":"6. Capital Costs","index":8,"n_rows":46,"n_cols":5,"rows_kept":46,"cut":false,"hidden":false,"merged":[]}
[]
[]
[]
[]
[]
[null,"This worksheet calculates the total capital costs required for your FED. "]
[]
[]
[null,"Please enter any initial investment costs in the table provided below. "]
[]
[]
[null,"Initial Investment Costs","Cost"]
[null,"Construction/Renovation"]
[null,"Other Costs",{"$f":"20*(EDMonthlyVolume*12)","v":212140}]
[null,"Total",{"$f":"SUBTOTAL(109,EquipCosts101315[Cost])","v":212140}]
[]
[null,"Recurring Annual Average Capital Costs"]
[null,"Please enter your equipment costs and the estimated salvage values in the table below. "]
[null,"*Note: If your organization is not-for-profit, later calculations will ignore the depreciation values. "]
[]
{"$rows_left_out":27}
{"sheet":"7. Operating Costs","index":9,"n_rows":87,"n_cols":7,"rows_kept":87,"cut":false,"hidden":false,"merged":[]}
[]
[]
[]
[]
[]
[null,"This worksheet calculates the total operating costs required for your FED. "]
[]
[null,"ED and Other Operating Costs"]
[null,"Please enter your facility, administrative, and other ED operating costs in the tables below. "]
[]
[null,"Facility Cost","Cost","Overhead rate per facility gross square foot:"]
[null,"Utilities & Maintenance",null,null,null,null,3.23]
[null,"Environmental Services"]
[null,"Dietary"]
[null,"Other Facility Cost (per sq ft)",{"$f":"12*Footage","v":239999.04000000004}]
[null,"Other Marginal Facility Cost",{"$f":"3*('8. Expected Revenue'!D41+'8. Expected Revenue'!D61)","v":71597.25}]
[null,"Total",{"$f":"SUBTOTAL(109,ClinSuppCosts111416[Cost])","v":311596.29000000004}]
[null,"Other Operating Costs","Cost"]
[null,"Other",0]
[null,"Other",0]
{"$rows_left_out":68}
{"sheet":"8. Expected Revenue","index":10,"n_rows":77,"n_cols":4,"rows_kept":77,"cut":false,"hidden":false,"merged":[]}
[]
[]
[]
[]
[]
[null,"This worksheet calculates expected revenue based on payer mix and estimated reimbursement. "]
[]
[]
[null,"Please enter your current estimated ED or outpatient payer mix into the table below. "]
[null,"*Note: Payer mix is considered the same for outpatient and ED in subsequent calculations. "]
[]
[null,null,"Estimated ED / Hospital Outpatient Payer Mix","Estimated %"]
[null,null,"Medicare",0.26700000000000002]
[null,null,"Medicaid",0.27400000000000002]
[null,null,"Self-Pay/Uninsured",0.22800000000000001]
[null,null,"Commercial",0.20100000000000001]
[null,null,"Other (Tricare, Worker's Comp, etc.)",0.03]
[null,null,"Total",{"$f":"SUM(D13,D14,D15,D16,D17)","v":1}]
[]
[]
{"$rows_left_out":58}
{"sheet":"9. Pro Forma","index":11,"n_rows":88,"n_cols":14,"rows_kept":88,"cut":false,"hidden":false,"merged":[]}
[]
[]
[]
[]
[]
[null,"This worksheet provides a summary using the data entered on previous sheets. "]
[null,"*Note: There is no data entry required on this sheet."]
[]
[]
[null,"Assumptions"]
[]
[null,"Construction/Renovation Costs",null,null,{"$f":"'6. Capital Costs'!C13","v":0},null,"Volume Growth Rate",null,null,{"$f":"DemandGrowthRate","v":8.8500000000000002E-3}]
[null,"Other Initial Investment Costs",null,null,{"$f":"'6. Capital Costs'!C14","v":212140},null,"Inflation Rate on Costs",null,null,{"$f":"'3. Key Assumptions'!D13","v":0.03}]
[null,"Staffing Cost",null,null,{"$f":"TotalStaffingCost","v":5705111.8584000012},null,"Organizational Tax Rate",null,null,{"$f":"TaxRate","v":0}]
[null,"Equipment Cost",null,null,{"$f":"TotalEquipCosts","v":10607},null,"Cost of Capital",null,null,{"$f":"CostofCapital","v":0.04}]
[null,"Other Capital Cost",null,null,{"$f":"OtherCapitalCosts","v":234414.7},null,"Purchasing Discount",null,null,{"$f":"Discount","v":0}]
[null,{"$f":"ClinSuppCosts111416[[#Headers],[Facility Cost]]","v":"Facility Cost"},null,null,{"$f":"ClinSuppCosts111416[[#Totals],[Cost]]","v":311596.29000000004},null,"Medicare Reimbursement Growth Rate",null,null,{"$f":"'3. Key Assumptions'!D62","v":2.1999999999999999E-2}]
[null,{"$f":"ClinSuppCosts1114[[#Headers],[ED Operating Cost]]","v":"ED Operating Cost"},null,null,{"$f":"ClinSuppCosts1114[[#Totals],[Cost]]","v":1994116},null,"Overhead Rate (per sq. ft.)",null,null,{"$f":"'7. Operating Costs'!G12","v":3.23}]
[null,{"$f":"LabCosts18[[#Headers],[Ancillary Cost]]","v":"Ancillary Cost"},null,null,{"$f":"TotalAncillaryCosts","v":570126.25},null,"Facility Square Footage",null,null,{"$f":"Footage","v":19999.920000000002}]
[]
{"$rows_left_out":69}
{"sheet":"10. Feasibility Results","index":12,"n_rows":262,"n_cols":8,"rows_kept":262,"cut":false,"hidden":false,"merged":[]}
[]
[]
[]
[]
[]
[null,null,"This worksheet provides a profitability analysis, scenario analysis, and sensitivity analysis using the information from previous worksheets. "]
[null,null,"*Note: There is no data entry required on this sheet."]
[]
[]
[null,null,"Profitability Analysis for: ",null,null,{"$f":"HospitalName","v":"General Hospital"}]
[]
[null,null,{"$f":"IF('9. Pro Forma'!E84>0,\"Based on your estimated costs and revenues, converting to a FED is profitable.\",\"Based on your estimated costs and revenues, converting to a FED is not profitable.\")","v":"Based on your estimated costs and revenues, converting to a FED is not profitable."}]
[]
[null,null,"Results: "]
[]
[null,null,"NPV","IRR","MIRR","Payback Period"]
[null,null,{"$f":"'9. Pro Forma'!E84","v":-4584157.6052147904},{"$f":"'9. Pro Forma'!E85","v":"Unable to Calculate"},{"$f":"'9. Pro Forma'!E86","v":-1},{"$f":"'9. Pro Forma'!E88","v":"Greater Than Projected Time Period"}]
[]
[null,null,"Explanation: "]
[]
{"$rows_left_out":243}
{"sheet":"Scenario Data","index":13,"n_rows":113,"n_cols":7,"rows_kept":113,"cut":false,"hidden":true,"merged":[[1,1,1,3]]}
[]
[null,"Scenario Data"]
[]
[null,"Scenario","Variable","Value"]
[null,"Base Case"]
[null,"Base Case"]
[null,"Base Case"]
[null,"Base Case"]
[null,"Base Case"]
[null,"Base Case"]
[null,"Base Case"]
[null,"Base Case"]
[null,"Base Case"]
[]
[]
[]
[null,"Scenario","Variable","Value",null,"Row Labels","Sum of Value"]
[null,0.03,"Cost of Capital",0.03,null,"Cost of Capital",0.04]
[null,0.04,"Cost of Capital",0.04,null,"Grand Total",0.04]
[null,0.05,"Cost of Capital",0.05]
{"$rows_left_out":94}
{"sheet":"Data Tables","index":14,"n_rows":186,"n_cols":12,"rows_kept":186,"cut":false,"hidden":true,"merged":[]}
[]
[]
[]
[]
[]
[]
[null,null,"Estimated Hospital Payer Mix","Estimated %"]
[null,null,"Medicare",{"$f":"'8. Expected Revenue'!D13","v":0.26700000000000002}]
[null,null,"Medicaid",{"$f":"'8. Expected Revenue'!D14","v":0.27400000000000002}]
[null,null,"Self Pay",{"$f":"'8. Expected Revenue'!D15","v":0.22800000000000001}]
[null,null,"Commercial",{"$f":"'8. Expected Revenue'!D16","v":0.20100000000000001}]
[null,null,"Other (TriCare, etc.)",{"$f":"'8. Expected Revenue'!D17","v":0.03}]
[null,null,"Total",{"$f":"SUM(D8,D9,D10,D11,D12)","v":1}]
[]
[]
[null,"Please enter your estimated reimbursement from each payer into the table below. "]
[]
[]
[null,null,"Payer Reimbursement Rates","Estimated %"]
[null,null,"Medicare",{"$f":"'8. Expected Revenue'!D24","v":0.129}]
{"$rows_left_out":167}
{"sheet":"Scenario Model","index":15,"n_rows":141,"n_cols":10,"rows_kept":141,"cut":false,"hidden":true,"merged":[]}
[]
[]
[]
[]
[]
[]
[null,null,"Estimated Hospital Payer Mix","Estimated %"]
[null,null,"Medicare",{"$f":"GETPIVOTDATA(\"Value\",'Scenario Data'!$F$98,\"Variable\",\"Medicare\")","v":0.33800000000000002}]
[null,null,"Medicaid",{"$f":"GETPIVOTDATA(\"Value\",'Scenario Data'!$F$98,\"Variable\",\"Medicaid\")","v":0.20699999999999999}]
[null,null,"Self Pay",{"$f":"GETPIVOTDATA(\"Value\",'Scenario Data'!$F$98,\"Variable\",\"Self Pay\")","v":0.185}]
[null,null,"Commercial",{"$f":"GETPIVOTDATA(\"Value\",'Scenario Data'!$F$98,\"Variable\",\"Commercial\")","v":0.247}]
[null,null,"Other (TriCare, etc.)",{"$f":"GETPIVOTDATA(\"Value\",'Scenario Data'!$F$98,\"Variable\",\"Other\")","v":2.3E-2}]
[null,null,"Total",{"$f":"SUM(D8,D9,D10,D11,D12)","v":1}]
[]
[]
[null,"Please enter your estimated reimbursement from each payer into the table below. "]
[]
[]
[null,null,"Payer Reimbursement Rates","Estimated %"]
[null,null,"Medicare",{"$f":"GETPIVOTDATA(\"Value\",'Scenario Data'!$F$65,\"Variable\",\"Medicare Reimbursement\")","v":0.99}]
{"$rows_left_out":122}
{"sheet":"Avg Cost Curve","index":16,"n_rows":122,"n_cols":19,"rows_kept":122,"cut":false,"hidden":true,"merged":[]}
[null,"12 Bed","12 Bed","12 Bed","12 Bed","12 Bed"]
["Scenario","ED Vis (Ann)","# Tot Visits","Tot Exp","Avg Cost/Visit","MC"]
["Min",8972,20187,8394467,{"$f":"D3/C3","v":415.83529003814334}]
[null,null,{"$f":"C5-3000","v":20866},{"$f":"D5-(3000*$F$6)","v":8476792.9636247605},{"$f":"D4/C4","v":406.24906372207232},{"$f":"(D4-D3)/(C4-C3)","v":121.24589635458102}]
["Model",10607,23866,8840822,370.4358501634124,{"$f":"(D5-D3)/(C5-C3)","v":121.32508833922262}]
["Mid",12000,27000,9221111,341.52262962962965,{"$f":"(D6-D5)/(C6-C5)","v":121.34301212507977}]
[null,null,{"$f":"C6+3000","v":30000},{"$f":"D6+(3000*$F$6)","v":9585140.0363752395},319.50466787917463]
[null,null,33000,9949169.072750479,301.48997190152966]
[null,null,36000,10313198.109125718,286.47772525349217]
[null,null,39000,10677227.145500958,273.77505501284509]
[null,null,42000,11041256.181876197,262.88705194943327]
[null,null,45000,11405285.218251437,253.4507826278097]
["Max",{"$f":"1800*12","v":21600},48600,11841911,243.66072016460905]
[]
[null,null,"sheet 2. annual ed plus annual OP","tab 9. F61"]
[null,null,"also on tab 8 annualized"]
[null,null,{"$f":"'8. Expected Revenue'!D41+'8. Expected Revenue'!D61","v":23865.75},{"$f":"'9. Pro Forma'!F61","v":8840821.8984000012}]
[]
["Scenario",null,"# Tot Visits","Tot Exp","Avg Cost/Visit"]
["Min",null,0,5945111,{"$f":"D20/C20","v":{"$error":"#DIV/0!"}}]
{"$rows_left_out":103}
{"sheet":"Expense Summary","index":17,"n_rows":64,"n_cols":13,"rows_kept":64,"cut":false,"hidden":true,"merged":[[0,1,0,4],[11,6,11,9],[12,7,12,9]]}
[null,"Summary"]
[null,null,"Low","Medium","High"]
[null,"# of Beds",6,{"$f":"NumberBeds","v":12},18]
[null,"Square Footage",14000,{"$f":"Footage","v":19999.920000000002},27500]
[null,"# of ED Visits (annually)",5341,{"$f":"'8. Expected Revenue'!D41","v":10607},15491]
[null,"# of OP Visits (annually)",4006,{"$f":"'8. Expected Revenue'!D61","v":13258.75},20603]
[null,"# of Total Visits (annually)",{"$f":"C5+C6","v":9347},{"$f":"D5+D6","v":23865.75},{"$f":"E5+E6","v":36094}]
[]
[]
[]
[]
[null,null,null,null,null,null,"Costs"]
[null,null,null,null,null,null,null,"Year 1"]
[null,null,null,null,null,null,null,"Low","Medium","High"]
[null,null,null,null,null,null,"Operating Costs"]
[null,null,null,null,null,null,"Staffing Costs",null,null,null,{"$f":"H16/H53","v":0},{"$f":"I16/I53","v":0},{"$f":"J16/J53","v":0}]
[null,null,null,null,null,null,"  Administration",154691,235298,235298]
[null,null,null,null,null,null,"  Clinical Providers",1610784,2660501,3733596]
[null,null,null,null,null,null,"  Clinical Support",1417390,1808817,2540614]
[null,null,null,null,null,null,"  Non-clinical Support",840011,1000496,1394467]
{"$rows_left_out":45}
{"sheet":"Assumptions","index":18,"n_rows":37,"n_cols":9,"rows_kept":37,"cut":false,"hidden":true,"merged":[[0,0,0,4]]}
["Assumptions"]
["Variable","Low","Medium","High",null,null,null,null,"Why?"]
["Volume Assumptions"]
["OP Volume","75% of ED Volume",1.25,1.33,null,null,null,null,"Basis reflects analysis of current hospitals volumes of similar size. As with most variables, this will vary significantly based on the hospital. Of the hospitals reviewed, the trend shows more OP volume in the larger hospitals."]
["Estimated Square Footage","# Beds X 2,333.33","X 1,666.67","X 1,527.8",null,null,null,null,"Square footage assumes a certain baseline needed to operate. As beds are added, there is a proportionally lower increase of space needed, due to economies of scale. "]
["Staff Assumptions",null,null,null,"Staff Cost Assumptions"]
["Staff FTEs",47.1,{"$f":"+LeadershipCosts[[#Totals],[FTEs]]+ProviderCosts[[#Totals],[FTEs]]+AdminCosts[[#Totals],[FTEs]]","v":63.599999999999994},89.7,"22.4% Staff Benefits Assumed",null,null,null,"Note: Included are only staffing differences. Other staff are included in each model. Additionally, some services are assumed contract labor under operating costs."]
["Administration"]
["  Emergency Services Director",1,1,1,null,null,null,null,"Fixed in all three models"]
["  Charge Nurse - ED",0.2,1,1,null,null,null,null,"Fixed in all three models"]
["Clinical Providers"]
["   MD",4.7,{"$f":"'5. Staffing Costs'!C18","v":7},9.4,"$280,000 salary plus benefits",null,null,null,"Minimum of 1 RN and 1 MD on all shifts for 6 bed. The 12 bed assumes 2 day/1 night and the 18 bed assumes a mix of 1-3 physicians/midlevels at different times."]
["   NP/PA",0,{"$f":"'5. Staffing Costs'!C19+'5. Staffing Costs'!C20","v":2.4},4.7,"$89,000 salary plus benefits",null,null,null,"NP/PA used interchangeably throughout for midlevel care, though supervision regulations vary by state. No midlevels in the 6 bed, 1 during the day in the 12 bed, and 1.5 during the day in the 18 bed."]
["Clinical Support"]
["   RN",4.7,{"$f":"'5. Staffing Costs'!C21","v":7},10.5,"$54,900 salary plus benefits"]
["   CNA/EMT",2.4,{"$f":"'5. Staffing Costs'!C22","v":4.6999999999999993},7,null,null,null,null,"Staffing is proportional to the number of beds actively serviced. "]
["  Unit Coordinator",0,{"$f":"'5. Staffing Costs'!C23","v":2.4},3.6,null,null,null,null,"Unit Coordinator duties are absorbed by other roles in the 6 bed. "]
["  Ultrasound Tech",2.4,{"$f":"'5. Staffing Costs'!C25","v":2.4},4.7,null,null,null,null,"Incorporates a minimum 1 day shift Ultrasound Tech (2.4 FTEs) in the 6 bed and 12 bed and 1.5 in the 18 beds."]
["  CT / X-Ray Tech",4.7,4.7,4.7,null,null,null,null,"Fixed in all three models"]
["  Med Lab Tech",4.7,4.7,4.7,null,null,null,null,"Fixed in all three models"]
{"$rows_left_out":18}
{"sheet":"3 Model Graph","index":19,"n_rows":25,"n_cols":14,"rows_kept":25,"cut":false,"hidden":true,"merged":[[22,6,24,6],[23,5,24,5],[1,0,1,2]]}
[]
["Three Models",null,null,null,null,null,null,null,null,null,null,null,null,"Three Models of Rural Free-Standing Emergency Departments"]
["6 Beds","12 Beds","18 Beds"]
["14,000 Sq Ft","20,000 Sq Ft","27,500 Sq Ft",null,null,null,null,null,null,null,"Three Models of Rural Free-Standing Emergency Departments"]
["5,341 ED Visits","10,815 ED Visits","15,491 ED Visits"]
["4,006 OP Visits","13,519 OP Visits","20,603 OP Visits"]
["47.9 FTEs","63.6 FTEs","89.7 FTEs"]
["$5.6m Yrly Exp","$8.9m Yrly Exp","$12.5m Yrly Exp"]
[]
[]
[]
[]
[null,null,null,null,"5,341 ED Visits"]
[null,null,null,null,"4,006 OP Visits","10,815 ED Visits"]
[null,null,null,null,"47.9 FTEs","13,519 OP Visits","15,491 ED Visits"]
[null,null,null,null,"$5.6m Yrly Exp","63.6 FTEs","20,603 OP Visits"]
[null,null,null,null,null,"$8.9m Yrly Exp","89.7 FTEs"]
[null,null,null,null,null,null,"$12.5m Yrly Exp"]
[]
[]
{"$rows_left_out":6}
{"sheet":"FED FAST Inputs","index":20,"n_rows":177,"n_cols":6,"rows_kept":177,"cut":false,"hidden":false,"merged":[]}
[]
[]
[]
[]
[]
[]
[]
[]
[]
[]
[]
[]
[null,"Hospital Information"]
[]
[null,"Hospital Name"]
[]
[null,"Hospital State"]
[]
[null,"Affiliation with Hospital System?"]
[null,"If yes, what % discount do you receive on equipment and supplies?"]
{"$rows_left_out":158}
{"sheet":"Definitions","index":21,"n_rows":139,"n_cols":2,"rows_kept":139,"cut":false,"hidden":false,"merged":[]}
[]
[]
[]
[]
[]
[]
[]
[]
[]
[]
[]
[null,"Acronyms"]
[null,"ACA: The Patient Protection and Affordable Care Act "]
[null,"ACEP: American College of Emergency Physicians"]
[null,"AHA: American Hospital Association"]
[null,"CAH: Critical Access Hospital"]
[null,"CMS: Center for Medicare & Medicaid Services"]
[null,"CNA: Certified Nursing Assistant"]
[null,"CON: Certificate of Need"]
[null,"CR: Computed Radiography"]
{"$rows_left_out":120}
{"sheet":"References","index":22,"n_rows":21,"n_cols":2,"rows_kept":21,"cut":false,"hidden":false,"merged":[]}
[]
[]
[]
[]
[]
[null,"Hospital Affiliation"]
[]
[null,"CMS Reimbursement for FEDs"]
[null,"Medicare Part B Reimbursement for FEDs"]
[]
[null,"Key Assumptions"]
[]
[null,"Consumer Price Index"]
[null,"Current & Historical Inflation Rates"]
[null,"Benchmarking 2.0 Health Care Facility Management Report "]
[null,"Hospital Mean Utility Cost per Gross Square Foot"]
[null,"Article: ER Visits Still Rising Despite ACA"]
[null,"HCUP Trends in ED Visits:  2006-2011"]
[null,"Patient Charges for Top 10 Diagnoses in the ED"]
[null,"CAH Financial Indicator Reports"]
{"$rows_left_out":2}
{"sheet":"Acknowledgements","index":23,"n_rows":8,"n_cols":1,"rows_kept":8,"cut":false,"hidden":false,"merged":[[5,0,5,7],[7,0,7,7]]}
[]
[]
[]
[]
[]
["This project was supported by the Federal Office of Rural Health Policy (FORHP), Health Resources and Services Administration (HRSA), U.S. Department of Health and Human Services (HHS) under cooperative agreement # U1CRH03714.  The information, conclusions and opinions expressed in this findings brief are those of the authors and no endorsement by FORHP, HRSA, HHS, or The University of North Carolina is intended or should be inferred."]
[]
["We’d also like to acknowledge and thank five students for their work developing the Freestanding Emergency Department Financial Assessment Strategic Tool.  Jasmin Hainey, MHA; Keenan Jones, MHA; Manasi Kulkarni, MHA; Katie Ward, MHA; and Jake Zisette, RN, MHA developed the tool as the final product for their Masters of Health Administration Capstone project. \n"]